{"text_format":"3","workbook":"xlsx","n_sheets":10,"sheets":["DECLARACION","TRIGO","CEBADA","COLZA","CARINATA","SOJA","MAIZ","Datos","Codigos","Valores"],"not_rendered":{"images":1,"macros":1,"defined_names":9,"comments":1},"read":"whole","date_system":"1900"}

{"sheet":"DECLARACION","index":0,"n_rows":13,"n_cols":8,"rows_kept":13,"merged":[[1,1,1,6],[2,1,2,6],[3,0,3,6],[5,0,5,1],[5,2,5,3],[7,0,7,1],[9,0,9,1],[11,0,11,1],[12,0,14,1]]}
[{"$nulls":4},"ZAFRA 2025-2026","V.",2]
["1- ","La presente planilla corresponde a la declaración de los bienes asegurados y complementa el Formulario de Solicitud (Fórmula 396-GRNIZO)"]
["2- ","Se debe iniciar la cotización con los datos de Tomador (Facturación C) o Asegurado (Facturación F) según corresponda (Certificado 0)"]
["Tenga en cuenta que si desea borrar un dato en una celda ya completada, debe presionar la tecla 'suprimir' o 'delete' para dejarla en blanco nuevamente."]
[{"$nulls":7},"Código Plan de Pago"]
["Planes de Pagos:",{"$nulls":6},{"$f":"IFERROR(VLOOKUP(C6,Codigo_Plan_de_pagos[#All],2,FALSE),115)","v":115}]
[]
["Número de Cliente (M):"]
[{"$nulls":7},"Fecha hasta"]
["ZAFRA A ASEGURAR:",{"$nulls":6},{"$f":"IF(C10=\"VERANO\", IF(TODAY()>DATE(YEAR(TODAY()),5,31), DATE(YEAR(TODAY())+1,5,31), DATE(YEAR(TODAY()),5,31)),IF(C10=\"INVIERNO\", IF(TODAY()>DATE(YEAR(TODAY()),12,31), DATE(YEAR(TODAY())+1,12,31), DATE(YEAR(TODAY()),12,31)), \"\"))","v":""}]
[]
["CULTIVOS A ASEGURAR:"]
["Para realizar la carga de los datos, elija de la lista desplegable los cultivos que va a asegurar y luego seleccione la hoja correspondiente "]

{"sheet":"TRIGO","index":1,"n_rows":46,"n_cols":15,"rows_kept":46,"hidden":true,"merged":[[1,1,1,2],[1,3,1,4],[2,1,2,2],[2,3,2,4],[4,1,5,3],[9,1,10,6],[14,1,14,8],[15,1,15,2],[15,3,15,5],[15,7,16,7],[15,8,16,8],[16,1,16,2],[16,4,16,5],[17,1,17,2],[18,1,18,2],[19,1,19,2],[20,1,20,2],[21,1,21,2],[22,1,22,2],[23,1,23,2],[24,1,24,2],[25,1,25,2],[26,1,26,2],[27,1,27,2],[28,1,28,2],[29,1,29,2],[30,1,30,2],[31,1,31,2],[32,1,32,2],[33,1,33,2],[34,1,34,2],[35,1,35,2],[36,1,36,2],[37,1,37,2],[38,1,38,2],[39,1,39,2],[40,1,40,2],[41,1,41,2],[42,1,42,2],[43,1,43,2],[44,1,44,2],[45,1,45,2]]}
[{"$nulls":9},"Código Cultivo"]
[null,"CULTIVO:",null,"TRIGO",{"$nulls":5},{"$f":"IFERROR(VLOOKUP(D2,codigo_CULTIVOS[],2,FALSE),\" \")","v":1}]
[null,"SUPERFICIE ASEGURADA",null,{"$f":"SUM($G$19:$G$1000)","v":{"v":0,"d":"0.00"}}]
[]
[null,"COBERTURA DE INVERSIÓN"]
[]
[null,"Garantía (Kg/ha)","Inicio de Cobertura por Chacra (Kg/ha)","Valor del grano (U$S/ton)",{"$nulls":5},"Limite por Chcra (Kg/Ha)"]
[{"$nulls":3},{"$f":"Valores!F2","v":220},{"$nulls":5},{"$f":"B8-C8","v":0}]
[]
[null,"DAÑOS DIRECTOS",{"$nulls":7},"Daños Directos"]
[{"$nulls":9},{"$f":"IFERROR(VLOOKUP(C13,DDIRECTOS[#Data],2,FALSE),\"N\")","v":"N"}]
[null,"Aforo (U$S/ha)","Granizo/Inc","Resiembra","Viento","Falta de Piso ","Helada",null,null,"Código Granizo/Inc.","Código Viento","Resiembra S/N","Código Flata de Piso","Helada","Codigo_Resiembra"]
[{"$nulls":9},{"$f":"IFERROR(VLOOKUP(C13,codigo_DEDUCIBLE[#Data],2,FALSE),\"N\")","v":"N"},{"$f":"IFERROR(VLOOKUP(E13,codigo­_VIENTO[#All],2,FALSE),\"N\")","v":"N"},{"$f":"IF(D13=\"\",\"N\",\"S\")","v":"N"},{"$f":"IF(F13=\"SI\",\"S\",\"N\")","v":"N"},{"$f":"IF(G13=\"SI\",\"S\",\"N\")","v":"N"},{"$f":"IFERROR(VLOOKUP(D13,Codigo_Resiembra[#All],2,FALSE),\" \")","v":" "}]
[]
[null,"DATOS DEL CULTIVO TRIGO"]
[null,"Datos del bien",null,"Ubicación",null,null,"Cultivo","Acreedor"]
[{"$nulls":4},"Grados Decimales",null,"Superficie"]
[null,"Nombre de Chacra",null,"Depto.","Lat.","Long.","ha","Código del Acreedor","Observaciones","Cód Dpto"]
[{"$nulls":9},{"$f":"IFERROR(VLOOKUP(D19,codigo_DEPARTAMENTO[],2,FALSE),\" \")","v":" "}]
[{"$nulls":9},{"$f":"IFERROR(VLOOKUP(D20,codigo_DEPARTAMENTO[],2,FALSE),\" \")","v":" "}]
[{"$nulls":9},{"$f":"IFERROR(VLOOKUP(D21,codigo_DEPARTAMENTO[],2,FALSE),\" \")","v":" "}]
[{"$nulls":9},{"$f":"IFERROR(VLOOKUP(D22,codigo_DEPARTAMENTO[],2,FALSE),\" \")","v":" "}]
[{"$nulls":9},{"$f":"IFERROR(VLOOKUP(D23,codigo_DEPARTAMENTO[],2,FALSE),\" \")","v":" "}]
[{"$nulls":9},{"$f":"IFERROR(VLOOKUP(D24,codigo_DEPARTAMENTO[],2,FALSE),\" \")","v":" "}]
[{"$nulls":9},{"$f":"IFERROR(VLOOKUP(D25,codigo_DEPARTAMENTO[],2,FALSE),\" \")","v":" "}]
[{"$nulls":9},{"$f":"IFERROR(VLOOKUP(D26,codigo_DEPARTAMENTO[],2,FALSE),\" \")","v":" "}]
[{"$nulls":9},{"$f":"IFERROR(VLOOKUP(D27,codigo_DEPARTAMENTO[],2,FALSE),\" \")","v":" "}]
[{"$nulls":9},{"$f":"IFERROR(VLOOKUP(D28,codigo_DEPARTAMENTO[],2,FALSE),\" \")","v":" "}]
[{"$nulls":9},{"$f":"IFERROR(VLOOKUP(D29,codigo_DEPARTAMENTO[],2,FALSE),\" \")","v":" "}]
[{"$nulls":9},{"$f":"IFERROR(VLOOKUP(D30,codigo_DEPARTAMENTO[],2,FALSE),\" \")","v":" "}]
[{"$nulls":9},{"$f":"IFERROR(VLOOKUP(D31,codigo_DEPARTAMENTO[],2,FALSE),\" \")","v":" "}]
[{"$nulls":9},{"$f":"IFERROR(VLOOKUP(D32,codigo_DEPARTAMENTO[],2,FALSE),\" \")","v":" "}]
[{"$nulls":9},{"$f":"IFERROR(VLOOKUP(D33,codigo_DEPARTAMENTO[],2,FALSE),\" \")","v":" "}]
[{"$nulls":9},{"$f":"IFERROR(VLOOKUP(D34,codigo_DEPARTAMENTO[],2,FALSE),\" \")","v":" "}]
[{"$nulls":9},{"$f":"IFERROR(VLOOKUP(D35,codigo_DEPARTAMENTO[],2,FALSE),\" \")","v":" "}]
[{"$nulls":9},{"$f":"IFERROR(VLOOKUP(D36,codigo_DEPARTAMENTO[],2,FALSE),\" \")","v":" "}]
[{"$nulls":9},{"$f":"IFERROR(VLOOKUP(D37,codigo_DEPARTAMENTO[],2,FALSE),\" \")","v":" "}]
[{"$nulls":9},{"$f":"IFERROR(VLOOKUP(D38,codigo_DEPARTAMENTO[],2,FALSE),\" \")","v":" "}]
[{"$nulls":9},{"$f":"IFERROR(VLOOKUP(D39,codigo_DEPARTAMENTO[],2,FALSE),\" \")","v":" "}]
[{"$nulls":9},{"$f":"IFERROR(VLOOKUP(D40,codigo_DEPARTAMENTO[],2,FALSE),\" \")","v":" "}]
[{"$nulls":9},{"$f":"IFERROR(VLOOKUP(D41,codigo_DEPARTAMENTO[],2,FALSE),\" \")","v":" "}]
[{"$nulls":9},{"$f":"IFERROR(VLOOKUP(D42,codigo_DEPARTAMENTO[],2,FALSE),\" \")","v":" "}]
[{"$nulls":9},{"$f":"IFERROR(VLOOKUP(D43,codigo_DEPARTAMENTO[],2,FALSE),\" \")","v":" "}]
[{"$nulls":9},{"$f":"IFERROR(VLOOKUP(D44,codigo_DEPARTAMENTO[],2,FALSE),\" \")","v":" "}]
[{"$nulls":9},{"$f":"IFERROR(VLOOKUP(D45,codigo_DEPARTAMENTO[],2,FALSE),\" \")","v":" "}]
[{"$nulls":9},{"$f":"IFERROR(VLOOKUP(D46,codigo_DEPARTAMENTO[],2,FALSE),\" \")","v":" "}]

{"sheet":"CEBADA","index":2,"n_rows":46,"n_cols":15,"rows_kept":46,"hidden":true,"merged":[[1,1,1,2],[1,3,1,4],[2,1,2,2],[2,3,2,4],[4,1,5,3],[9,1,10,6],[14,1,14,8],[15,1,15,2],[15,3,15,5],[15,7,16,7],[15,8,16,8],[16,1,16,2],[16,4,16,5],[17,1,17,2],[18,1,18,2],[19,1,19,2],[20,1,20,2],[21,1,21,2],[22,1,22,2],[23,1,23,2],[24,1,24,2],[25,1,25,2],[26,1,26,2],[27,1,27,2],[28,1,28,2],[29,1,29,2],[30,1,30,2],[31,1,31,2],[32,1,32,2],[33,1,33,2],[34,1,34,2],[35,1,35,2],[36,1,36,2],[37,1,37,2],[38,1,38,2],[39,1,39,2],[40,1,40,2],[41,1,41,2],[42,1,42,2],[43,1,43,2],[44,1,44,2],[45,1,45,2]]}
[{"$nulls":9},"Código Cultivo"]
[null,"CULTIVO:",null,"CEBADA",{"$nulls":5},{"$f":"IFERROR(VLOOKUP(D2,codigo_CULTIVOS[],2,FALSE),\" \")","v":2}]
[null,"SUPERFICIE ASEGURADA",null,{"$f":"SUM($G$19:$G$1000)","v":{"v":0,"d":"0.00"}}]
[]
[null,"COBERTURA DE INVERSIÓN"]
[]
[null,"Garantía (Kg/ha)","Inicio de Cobertura por Chacra (Kg/ha)","Valor del grano (U$S/ton)",{"$nulls":5},"Limite por Chcra (Kg/Ha)"]
[{"$nulls":3},{"$f":"Valores!F2","v":220},{"$nulls":5},{"$f":"B8-C8","v":0}]
[]
[null,"DAÑOS DIRECTOS",{"$nulls":7},"Daños Directos"]
[{"$nulls":9},{"$f":"IFERROR(VLOOKUP(C13,DDIRECTOS[#Data],2,FALSE),\"N\")","v":"N"}]
[null,"Aforo (U$S/ha)","Granizo/Inc","Resiembra","Viento","Falta de Piso ","Helada",null,null,"Código Granizo/Inc.","Código Viento","Resiembra S/N","Código Flata de Piso","Helada","Codigo_Resiembra"]
[{"$nulls":9},{"$f":"IFERROR(VLOOKUP(C13,codigo_DEDUCIBLE[#Data],2,FALSE),\"N\")","v":"N"},{"$f":"IFERROR(VLOOKUP(E13,codigo­_VIENTO[#All],2,FALSE),\"N\")","v":"N"},{"$f":"IF(D13=\"\",\"N\",\"S\")","v":"N"},{"$f":"IF(F13=\"SI\",\"S\",\"N\")","v":"N"},{"$f":"IF(G13=\"SI\",\"S\",\"N\")","v":"N"},{"$f":"IFERROR(VLOOKUP(D13,Codigo_Resiembra[#All],2,FALSE),\" \")","v":" "}]
[]
[null,"DATOS DEL CULTIVO CEBADA"]
[null,"Datos del bien",null,"Ubicación",null,null,"Cultivo","Acreedor"]
[{"$nulls":4},"Grados Decimales",null,"Superficie"]
[null,"Nombre de Chacra",null,"Depto.","Lat.","Long.","ha","Código del Acreedor","Observaciones","Cód Dpto"]
[{"$nulls":9},{"$f":"IFERROR(VLOOKUP(D19,codigo_DEPARTAMENTO[],2,FALSE),\" \")","v":" "}]
[{"$nulls":9},{"$f":"IFERROR(VLOOKUP(D20,codigo_DEPARTAMENTO[],2,FALSE),\" \")","v":" "}]
[{"$nulls":9},{"$f":"IFERROR(VLOOKUP(D21,codigo_DEPARTAMENTO[],2,FALSE),\" \")","v":" "}]
[{"$nulls":9},{"$f":"IFERROR(VLOOKUP(D22,codigo_DEPARTAMENTO[],2,FALSE),\" \")","v":" "}]
[{"$nulls":9},{"$f":"IFERROR(VLOOKUP(D23,codigo_DEPARTAMENTO[],2,FALSE),\" \")","v":" "}]
[{"$nulls":9},{"$f":"IFERROR(VLOOKUP(D24,codigo_DEPARTAMENTO[],2,FALSE),\" \")","v":" "}]
[{"$nulls":9},{"$f":"IFERROR(VLOOKUP(D25,codigo_DEPARTAMENTO[],2,FALSE),\" \")","v":" "}]
[{"$nulls":9},{"$f":"IFERROR(VLOOKUP(D26,codigo_DEPARTAMENTO[],2,FALSE),\" \")","v":" "}]
[{"$nulls":9},{"$f":"IFERROR(VLOOKUP(D27,codigo_DEPARTAMENTO[],2,FALSE),\" \")","v":" "}]
[{"$nulls":9},{"$f":"IFERROR(VLOOKUP(D28,codigo_DEPARTAMENTO[],2,FALSE),\" \")","v":" "}]
[{"$nulls":9},{"$f":"IFERROR(VLOOKUP(D29,codigo_DEPARTAMENTO[],2,FALSE),\" \")","v":" "}]
[{"$nulls":9},{"$f":"IFERROR(VLOOKUP(D30,codigo_DEPARTAMENTO[],2,FALSE),\" \")","v":" "}]
[{"$nulls":9},{"$f":"IFERROR(VLOOKUP(D31,codigo_DEPARTAMENTO[],2,FALSE),\" \")","v":" "}]
[{"$nulls":9},{"$f":"IFERROR(VLOOKUP(D32,codigo_DEPARTAMENTO[],2,FALSE),\" \")","v":" "}]
[{"$nulls":9},{"$f":"IFERROR(VLOOKUP(D33,codigo_DEPARTAMENTO[],2,FALSE),\" \")","v":" "}]
[{"$nulls":9},{"$f":"IFERROR(VLOOKUP(D34,codigo_DEPARTAMENTO[],2,FALSE),\" \")","v":" "}]
[{"$nulls":9},{"$f":"IFERROR(VLOOKUP(D35,codigo_DEPARTAMENTO[],2,FALSE),\" \")","v":" "}]
[{"$nulls":9},{"$f":"IFERROR(VLOOKUP(D36,codigo_DEPARTAMENTO[],2,FALSE),\" \")","v":" "}]
[{"$nulls":9},{"$f":"IFERROR(VLOOKUP(D37,codigo_DEPARTAMENTO[],2,FALSE),\" \")","v":" "}]
[{"$nulls":9},{"$f":"IFERROR(VLOOKUP(D38,codigo_DEPARTAMENTO[],2,FALSE),\" \")","v":" "}]
[{"$nulls":9},{"$f":"IFERROR(VLOOKUP(D39,codigo_DEPARTAMENTO[],2,FALSE),\" \")","v":" "}]
[{"$nulls":9},{"$f":"IFERROR(VLOOKUP(D40,codigo_DEPARTAMENTO[],2,FALSE),\" \")","v":" "}]
[{"$nulls":9},{"$f":"IFERROR(VLOOKUP(D41,codigo_DEPARTAMENTO[],2,FALSE),\" \")","v":" "}]
[{"$nulls":9},{"$f":"IFERROR(VLOOKUP(D42,codigo_DEPARTAMENTO[],2,FALSE),\" \")","v":" "}]
[{"$nulls":9},{"$f":"IFERROR(VLOOKUP(D43,codigo_DEPARTAMENTO[],2,FALSE),\" \")","v":" "}]
[{"$nulls":9},{"$f":"IFERROR(VLOOKUP(D44,codigo_DEPARTAMENTO[],2,FALSE),\" \")","v":" "}]
[{"$nulls":9},{"$f":"IFERROR(VLOOKUP(D45,codigo_DEPARTAMENTO[],2,FALSE),\" \")","v":" "}]
[{"$nulls":9},{"$f":"IFERROR(VLOOKUP(D46,codigo_DEPARTAMENTO[],2,FALSE),\" \")","v":" "}]

{"sheet":"COLZA","index":3,"n_rows":46,"n_cols":15,"rows_kept":46,"hidden":true,"merged":[[1,1,1,2],[1,3,1,4],[2,1,2,2],[2,3,2,4],[4,1,5,3],[9,1,10,6],[14,1,14,8],[15,1,15,2],[15,3,15,5],[15,7,16,7],[15,8,16,8],[16,1,16,2],[16,4,16,5],[17,1,17,2],[18,1,18,2],[19,1,19,2],[20,1,20,2],[21,1,21,2],[22,1,22,2],[23,1,23,2],[24,1,24,2],[25,1,25,2],[26,1,26,2],[27,1,27,2],[28,1,28,2],[29,1,29,2],[30,1,30,2],[31,1,31,2],[32,1,32,2],[33,1,33,2],[34,1,34,2],[35,1,35,2],[36,1,36,2],[37,1,37,2],[38,1,38,2],[39,1,39,2],[40,1,40,2],[41,1,41,2],[42,1,42,2],[43,1,43,2],[44,1,44,2],[45,1,45,2]]}
[{"$nulls":9},"Código Cultivo"]
[null,"CULTIVO:",null,"COLZA",{"$nulls":5},{"$f":"IFERROR(VLOOKUP(D2,codigo_CULTIVOS[],2,FALSE),\" \")","v":15}]
[null,"SUPERFICIE ASEGURADA",null,{"$f":"SUM($G$19:$G$1000)","v":{"v":0,"d":"0.00"}}]
[]
[null,"COBERTURA DE INVERSIÓN"]
[]
[null,"Garantía (Kg/ha)","Inicio de Cobertura por Chacra (Kg/ha)","Valor del grano (U$S/ton)",{"$nulls":5},"Limite por Chcra (Kg/Ha)"]
[{"$nulls":3},{"$f":"Valores!F4","v":450},{"$nulls":5},{"$f":"B8-C8","v":0}]
[]
[null,"DAÑOS DIRECTOS",{"$nulls":7},"Daños Directos"]
[{"$nulls":9},{"$f":"IFERROR(VLOOKUP(C13,DDIRECTOS[#Data],2,FALSE),\"N\")","v":"N"}]
[null,"Aforo (U$S/ha)","Granizo/Inc","Resiembra","Viento","Falta de Piso ","Helada",null,null,"Código Granizo/Inc.","Código Viento","Resiembra S/N","Código Flata de Piso","Helada","Codigo_Resiembra"]
[{"$nulls":9},{"$f":"IFERROR(VLOOKUP(C13,codigo_DEDUCIBLE[#Data],2,FALSE),\"N\")","v":"N"},{"$f":"IFERROR(VLOOKUP(E13,codigo­_VIENTO[#All],2,FALSE),\"N\")","v":"N"},{"$f":"IF(D13=\"\",\"N\",\"S\")","v":"N"},{"$f":"IF(F13=\"SI\",\"S\",\"N\")","v":"N"},{"$f":"IF(G13=\"SI\",\"S\",\"N\")","v":"N"},{"$f":"IFERROR(VLOOKUP(D13,Codigo_Resiembra[#All],2,FALSE),\" \")","v":" "}]
[]
[null,"DATOS DEL CULTIVO COLZA"]
[null,"Datos del bien",null,"Ubicación",null,null,"Cultivo","Acreedor"]
[{"$nulls":4},"Grados Decimales",null,"Superficie"]
[null,"Nombre de Chacra",null,"Depto.","Lat.","Long.","ha","Código del Acreedor","Observaciones","Cód Dpto"]
[{"$nulls":9},{"$f":"IFERROR(VLOOKUP(D19,codigo_DEPARTAMENTO[],2,FALSE),\" \")","v":" "}]
[{"$nulls":9},{"$f":"IFERROR(VLOOKUP(D20,codigo_DEPARTAMENTO[],2,FALSE),\" \")","v":" "}]
[{"$nulls":9},{"$f":"IFERROR(VLOOKUP(D21,codigo_DEPARTAMENTO[],2,FALSE),\" \")","v":" "}]
[{"$nulls":9},{"$f":"IFERROR(VLOOKUP(D22,codigo_DEPARTAMENTO[],2,FALSE),\" \")","v":" "}]
[{"$nulls":9},{"$f":"IFERROR(VLOOKUP(D23,codigo_DEPARTAMENTO[],2,FALSE),\" \")","v":" "}]
[{"$nulls":9},{"$f":"IFERROR(VLOOKUP(D24,codigo_DEPARTAMENTO[],2,FALSE),\" \")","v":" "}]
[{"$nulls":9},{"$f":"IFERROR(VLOOKUP(D25,codigo_DEPARTAMENTO[],2,FALSE),\" \")","v":" "}]
[{"$nulls":9},{"$f":"IFERROR(VLOOKUP(D26,codigo_DEPARTAMENTO[],2,FALSE),\" \")","v":" "}]
[{"$nulls":9},{"$f":"IFERROR(VLOOKUP(D27,codigo_DEPARTAMENTO[],2,FALSE),\" \")","v":" "}]
[{"$nulls":9},{"$f":"IFERROR(VLOOKUP(D28,codigo_DEPARTAMENTO[],2,FALSE),\" \")","v":" "}]
[{"$nulls":9},{"$f":"IFERROR(VLOOKUP(D29,codigo_DEPARTAMENTO[],2,FALSE),\" \")","v":" "}]
[{"$nulls":9},{"$f":"IFERROR(VLOOKUP(D30,codigo_DEPARTAMENTO[],2,FALSE),\" \")","v":" "}]
[{"$nulls":9},{"$f":"IFERROR(VLOOKUP(D31,codigo_DEPARTAMENTO[],2,FALSE),\" \")","v":" "}]
[{"$nulls":9},{"$f":"IFERROR(VLOOKUP(D32,codigo_DEPARTAMENTO[],2,FALSE),\" \")","v":" "}]
[{"$nulls":9},{"$f":"IFERROR(VLOOKUP(D33,codigo_DEPARTAMENTO[],2,FALSE),\" \")","v":" "}]
[{"$nulls":9},{"$f":"IFERROR(VLOOKUP(D34,codigo_DEPARTAMENTO[],2,FALSE),\" \")","v":" "}]
[{"$nulls":9},{"$f":"IFERROR(VLOOKUP(D35,codigo_DEPARTAMENTO[],2,FALSE),\" \")","v":" "}]
[{"$nulls":9},{"$f":"IFERROR(VLOOKUP(D36,codigo_DEPARTAMENTO[],2,FALSE),\" \")","v":" "}]
[{"$nulls":9},{"$f":"IFERROR(VLOOKUP(D37,codigo_DEPARTAMENTO[],2,FALSE),\" \")","v":" "}]
[{"$nulls":9},{"$f":"IFERROR(VLOOKUP(D38,codigo_DEPARTAMENTO[],2,FALSE),\" \")","v":" "}]
[{"$nulls":9},{"$f":"IFERROR(VLOOKUP(D39,codigo_DEPARTAMENTO[],2,FALSE),\" \")","v":" "}]
[{"$nulls":9},{"$f":"IFERROR(VLOOKUP(D40,codigo_DEPARTAMENTO[],2,FALSE),\" \")","v":" "}]
[{"$nulls":9},{"$f":"IFERROR(VLOOKUP(D41,codigo_DEPARTAMENTO[],2,FALSE),\" \")","v":" "}]
[{"$nulls":9},{"$f":"IFERROR(VLOOKUP(D42,codigo_DEPARTAMENTO[],2,FALSE),\" \")","v":" "}]
[{"$nulls":9},{"$f":"IFERROR(VLOOKUP(D43,codigo_DEPARTAMENTO[],2,FALSE),\" \")","v":" "}]
[{"$nulls":9},{"$f":"IFERROR(VLOOKUP(D44,codigo_DEPARTAMENTO[],2,FALSE),\" \")","v":" "}]
[{"$nulls":9},{"$f":"IFERROR(VLOOKUP(D45,codigo_DEPARTAMENTO[],2,FALSE),\" \")","v":" "}]
[{"$nulls":9},{"$f":"IFERROR(VLOOKUP(D46,codigo_DEPARTAMENTO[],2,FALSE),\" \")","v":" "}]

{"sheet":"CARINATA","index":4,"n_rows":46,"n_cols":15,"rows_kept":46,"hidden":true,"merged":[[1,1,1,2],[1,3,1,4],[2,1,2,2],[2,3,2,4],[4,1,5,3],[9,1,10,6],[14,1,14,8],[15,1,15,2],[15,3,15,5],[15,7,16,7],[15,8,16,8],[16,1,16,2],[16,4,16,5],[17,1,17,2],[18,1,18,2],[19,1,19,2],[20,1,20,2],[21,1,21,2],[22,1,22,2],[23,1,23,2],[24,1,24,2],[25,1,25,2],[26,1,26,2],[27,1,27,2],[28,1,28,2],[29,1,29,2],[30,1,30,2],[31,1,31,2],[32,1,32,2],[33,1,33,2],[34,1,34,2],[35,1,35,2],[36,1,36,2],[37,1,37,2],[38,1,38,2],[39,1,39,2],[40,1,40,2],[41,1,41,2],[42,1,42,2],[43,1,43,2],[44,1,44,2],[45,1,45,2]]}
[{"$nulls":9},"Código Cultivo"]
[null,"CULTIVO:",null,"CARINATA",{"$nulls":5},{"$f":"IFERROR(VLOOKUP(D2,codigo_CULTIVOS[],2,FALSE),\" \")","v":9}]
[null,"SUPERFICIE ASEGURADA",null,{"$f":"SUM($G$19:$G$1000)","v":{"v":0,"d":"0.00"}}]
[]
[null,"COBERTURA DE INVERSIÓN"]
[]
[null,"Garantía (Kg/ha)","Inicio de Cobertura por Chacra (Kg/ha)","Valor del grano (U$S/ton)",{"$nulls":5},"Limite por Chcra (Kg/Ha)"]
[{"$nulls":3},{"$f":"Valores!F5","v":450},{"$nulls":5},{"$f":"B8-C8","v":0}]
[]
[null,"DAÑOS DIRECTOS",{"$nulls":7},"Daños Directos"]
[{"$nulls":9},{"$f":"IFERROR(VLOOKUP(C13,DDIRECTOS[#Data],2,FALSE),\"N\")","v":"N"}]
[null,"Aforo (U$S/ha)","Granizo/Inc","Resiembra","Viento","Falta de Piso ","Helada",null,null,"Código Granizo/Inc.","Código Viento","Resiembra S/N","Código Flata de Piso","Helada","Codigo_Resiembra"]
[{"$nulls":9},{"$f":"IFERROR(VLOOKUP(C13,codigo_DEDUCIBLE[#Data],2,FALSE),\"N\")","v":"N"},{"$f":"IFERROR(VLOOKUP(E13,codigo­_VIENTO[#All],2,FALSE),\"N\")","v":"N"},{"$f":"IF(D13=\"\",\"N\",\"S\")","v":"N"},{"$f":"IF(F13=\"SI\",\"S\",\"N\")","v":"N"},{"$f":"IF(G13=\"SI\",\"S\",\"N\")","v":"N"},{"$f":"IFERROR(VLOOKUP(D13,Codigo_Resiembra[#All],2,FALSE),\" \")","v":" "}]
[]
[null,"DATOS DEL CULTIVO CARINATA"]
[null,"Datos del bien",null,"Ubicación",null,null,"Cultivo","Acreedor"]
[{"$nulls":4},"Grados Decimales",null,"Superficie"]
[null,"Nombre de Chacra",null,"Depto.","Lat.","Long.","ha","Código del Acreedor","Observaciones","Cód Dpto"]
[{"$nulls":9},{"$f":"IFERROR(VLOOKUP(D19,codigo_DEPARTAMENTO[],2,FALSE),\" \")","v":" "}]
[{"$nulls":9},{"$f":"IFERROR(VLOOKUP(D20,codigo_DEPARTAMENTO[],2,FALSE),\" \")","v":" "}]
[{"$nulls":9},{"$f":"IFERROR(VLOOKUP(D21,codigo_DEPARTAMENTO[],2,FALSE),\" \")","v":" "}]
[{"$nulls":9},{"$f":"IFERROR(VLOOKUP(D22,codigo_DEPARTAMENTO[],2,FALSE),\" \")","v":" "}]
[{"$nulls":9},{"$f":"IFERROR(VLOOKUP(D23,codigo_DEPARTAMENTO[],2,FALSE),\" \")","v":" "}]
[{"$nulls":9},{"$f":"IFERROR(VLOOKUP(D24,codigo_DEPARTAMENTO[],2,FALSE),\" \")","v":" "}]
[{"$nulls":9},{"$f":"IFERROR(VLOOKUP(D25,codigo_DEPARTAMENTO[],2,FALSE),\" \")","v":" "}]
[{"$nulls":9},{"$f":"IFERROR(VLOOKUP(D26,codigo_DEPARTAMENTO[],2,FALSE),\" \")","v":" "}]
[{"$nulls":9},{"$f":"IFERROR(VLOOKUP(D27,codigo_DEPARTAMENTO[],2,FALSE),\" \")","v":" "}]
[{"$nulls":9},{"$f":"IFERROR(VLOOKUP(D28,codigo_DEPARTAMENTO[],2,FALSE),\" \")","v":" "}]
[{"$nulls":9},{"$f":"IFERROR(VLOOKUP(D29,codigo_DEPARTAMENTO[],2,FALSE),\" \")","v":" "}]
[{"$nulls":9},{"$f":"IFERROR(VLOOKUP(D30,codigo_DEPARTAMENTO[],2,FALSE),\" \")","v":" "}]
[{"$nulls":9},{"$f":"IFERROR(VLOOKUP(D31,codigo_DEPARTAMENTO[],2,FALSE),\" \")","v":" "}]
[{"$nulls":9},{"$f":"IFERROR(VLOOKUP(D32,codigo_DEPARTAMENTO[],2,FALSE),\" \")","v":" "}]
[{"$nulls":9},{"$f":"IFERROR(VLOOKUP(D33,codigo_DEPARTAMENTO[],2,FALSE),\" \")","v":" "}]
[{"$nulls":9},{"$f":"IFERROR(VLOOKUP(D34,codigo_DEPARTAMENTO[],2,FALSE),\" \")","v":" "}]
[{"$nulls":9},{"$f":"IFERROR(VLOOKUP(D35,codigo_DEPARTAMENTO[],2,FALSE),\" \")","v":" "}]
[{"$nulls":9},{"$f":"IFERROR(VLOOKUP(D36,codigo_DEPARTAMENTO[],2,FALSE),\" \")","v":" "}]
[{"$nulls":9},{"$f":"IFERROR(VLOOKUP(D37,codigo_DEPARTAMENTO[],2,FALSE),\" \")","v":" "}]
[{"$nulls":9},{"$f":"IFERROR(VLOOKUP(D38,codigo_DEPARTAMENTO[],2,FALSE),\" \")","v":" "}]
[{"$nulls":9},{"$f":"IFERROR(VLOOKUP(D39,codigo_DEPARTAMENTO[],2,FALSE),\" \")","v":" "}]
[{"$nulls":9},{"$f":"IFERROR(VLOOKUP(D40,codigo_DEPARTAMENTO[],2,FALSE),\" \")","v":" "}]
[{"$nulls":9},{"$f":"IFERROR(VLOOKUP(D41,codigo_DEPARTAMENTO[],2,FALSE),\" \")","v":" "}]
[{"$nulls":9},{"$f":"IFERROR(VLOOKUP(D42,codigo_DEPARTAMENTO[],2,FALSE),\" \")","v":" "}]
[{"$nulls":9},{"$f":"IFERROR(VLOOKUP(D43,codigo_DEPARTAMENTO[],2,FALSE),\" \")","v":" "}]
[{"$nulls":9},{"$f":"IFERROR(VLOOKUP(D44,codigo_DEPARTAMENTO[],2,FALSE),\" \")","v":" "}]
[{"$nulls":9},{"$f":"IFERROR(VLOOKUP(D45,codigo_DEPARTAMENTO[],2,FALSE),\" \")","v":" "}]
[{"$nulls":9},{"$f":"IFERROR(VLOOKUP(D46,codigo_DEPARTAMENTO[],2,FALSE),\" \")","v":" "}]

{"sheet":"SOJA","index":5,"n_rows":46,"n_cols":15,"rows_kept":46,"hidden":true,"merged":[[1,1,1,2],[1,3,1,4],[2,1,2,2],[2,3,2,4],[4,1,5,3],[9,1,10,6],[14,1,14,8],[15,1,15,2],[15,3,15,5],[15,7,16,7],[15,8,16,8],[16,1,16,2],[16,4,16,5],[17,1,17,2],[18,1,18,2],[19,1,19,2],[20,1,20,2],[21,1,21,2],[22,1,22,2],[23,1,23,2],[24,1,24,2],[25,1,25,2],[26,1,26,2],[27,1,27,2],[28,1,28,2],[29,1,29,2],[30,1,30,2],[31,1,31,2],[32,1,32,2],[33,1,33,2],[34,1,34,2],[35,1,35,2],[36,1,36,2],[37,1,37,2],[38,1,38,2],[39,1,39,2],[40,1,40,2],[41,1,41,2],[42,1,42,2],[43,1,43,2],[44,1,44,2],[45,1,45,2]]}
[{"$nulls":9},"Código Cultivo"]
[null,"CULTIVO:",null,"SOJA",{"$nulls":5},{"$f":"IFERROR(VLOOKUP(D2,codigo_CULTIVOS[],2,FALSE),\" \")","v":12}]
[null,"SUPERFICIE ASEGURADA",null,{"$f":"SUM($G$19:$G$1000)","v":{"v":0,"d":"0.00"}}]
[]
[null,"COBERTURA DE INVERSIÓN"]
[]
[null,"Garantía (Kg/ha)","Inicio de Cobertura por Chacra (Kg/ha)","Valor del grano (U$S/ton)",{"$nulls":5},"Limite por Chcra (Kg/Ha)"]
[{"$nulls":3},{"$f":"Valores!F6","v":390},{"$nulls":5},{"$f":"B8-C8","v":0}]
[]
[null,"DAÑOS DIRECTOS",{"$nulls":7},"Daños Directos"]
[{"$nulls":9},{"$f":"IFERROR(VLOOKUP(C13,DDIRECTOS[#Data],2,FALSE),\"N\")","v":"N"}]
[null,"Aforo (U$S/ha)","Granizo/Inc","Resiembra","Viento","Falta de Piso ","Helada",null,null,"Código Granizo/Inc.","Código Viento","Resiembra S/N","Código Flata de Piso","Helada","Codigo_Resiembra"]
[{"$nulls":9},{"$f":"IFERROR(VLOOKUP(C13,codigo_DEDUCIBLE[#Data],2,FALSE),\"N\")","v":"N"},{"$f":"IFERROR(VLOOKUP(E13,codigo­_VIENTO[#All],2,FALSE),\"N\")","v":"N"},{"$f":"IF(D13=\"\",\"N\",\"S\")","v":"N"},{"$f":"IF(F13=\"SI\",\"S\",\"N\")","v":"N"},{"$f":"IF(G13=\"SI\",\"S\",\"N\")","v":"N"},{"$f":"IFERROR(VLOOKUP(D13,Codigo_Resiembra[#All],2,FALSE),\" \")","v":" "}]
[]
[null,"DATOS DEL CULTIVO SOJA"]
[null,"Datos del bien",null,"Ubicación",null,null,"Cultivo","Acreedor"]
[{"$nulls":4},"Grados Decimales",null,"Superficie"]
[null,"Nombre de Chacra",null,"Depto.","Lat.","Long.","ha","Código del Acreedor","Observaciones","Cód Dpto"]
[{"$nulls":9},{"$f":"IFERROR(VLOOKUP(D19,codigo_DEPARTAMENTO[],2,FALSE),\" \")","v":" "}]
[{"$nulls":9},{"$f":"IFERROR(VLOOKUP(D20,codigo_DEPARTAMENTO[],2,FALSE),\" \")","v":" "}]
[{"$nulls":9},{"$f":"IFERROR(VLOOKUP(D21,codigo_DEPARTAMENTO[],2,FALSE),\" \")","v":" "}]
[{"$nulls":9},{"$f":"IFERROR(VLOOKUP(D22,codigo_DEPARTAMENTO[],2,FALSE),\" \")","v":" "}]
[{"$nulls":9},{"$f":"IFERROR(VLOOKUP(D23,codigo_DEPARTAMENTO[],2,FALSE),\" \")","v":" "}]
[{"$nulls":9},{"$f":"IFERROR(VLOOKUP(D24,codigo_DEPARTAMENTO[],2,FALSE),\" \")","v":" "}]
[{"$nulls":9},{"$f":"IFERROR(VLOOKUP(D25,codigo_DEPARTAMENTO[],2,FALSE),\" \")","v":" "}]
[{"$nulls":9},{"$f":"IFERROR(VLOOKUP(D26,codigo_DEPARTAMENTO[],2,FALSE),\" \")","v":" "}]
[{"$nulls":9},{"$f":"IFERROR(VLOOKUP(D27,codigo_DEPARTAMENTO[],2,FALSE),\" \")","v":" "}]
[{"$nulls":9},{"$f":"IFERROR(VLOOKUP(D28,codigo_DEPARTAMENTO[],2,FALSE),\" \")","v":" "}]
[{"$nulls":9},{"$f":"IFERROR(VLOOKUP(D29,codigo_DEPARTAMENTO[],2,FALSE),\" \")","v":" "}]
[{"$nulls":9},{"$f":"IFERROR(VLOOKUP(D30,codigo_DEPARTAMENTO[],2,FALSE),\" \")","v":" "}]
[{"$nulls":9},{"$f":"IFERROR(VLOOKUP(D31,codigo_DEPARTAMENTO[],2,FALSE),\" \")","v":" "}]
[{"$nulls":9},{"$f":"IFERROR(VLOOKUP(D32,codigo_DEPARTAMENTO[],2,FALSE),\" \")","v":" "}]
[{"$nulls":9},{"$f":"IFERROR(VLOOKUP(D33,codigo_DEPARTAMENTO[],2,FALSE),\" \")","v":" "}]
[{"$nulls":9},{"$f":"IFERROR(VLOOKUP(D34,codigo_DEPARTAMENTO[],2,FALSE),\" \")","v":" "}]
[{"$nulls":9},{"$f":"IFERROR(VLOOKUP(D35,codigo_DEPARTAMENTO[],2,FALSE),\" \")","v":" "}]
[{"$nulls":9},{"$f":"IFERROR(VLOOKUP(D36,codigo_DEPARTAMENTO[],2,FALSE),\" \")","v":" "}]
[{"$nulls":9},{"$f":"IFERROR(VLOOKUP(D37,codigo_DEPARTAMENTO[],2,FALSE),\" \")","v":" "}]
[{"$nulls":9},{"$f":"IFERROR(VLOOKUP(D38,codigo_DEPARTAMENTO[],2,FALSE),\" \")","v":" "}]
[{"$nulls":9},{"$f":"IFERROR(VLOOKUP(D39,codigo_DEPARTAMENTO[],2,FALSE),\" \")","v":" "}]
[{"$nulls":9},{"$f":"IFERROR(VLOOKUP(D40,codigo_DEPARTAMENTO[],2,FALSE),\" \")","v":" "}]
[{"$nulls":9},{"$f":"IFERROR(VLOOKUP(D41,codigo_DEPARTAMENTO[],2,FALSE),\" \")","v":" "}]
[{"$nulls":9},{"$f":"IFERROR(VLOOKUP(D42,codigo_DEPARTAMENTO[],2,FALSE),\" \")","v":" "}]
[{"$nulls":9},{"$f":"IFERROR(VLOOKUP(D43,codigo_DEPARTAMENTO[],2,FALSE),\" \")","v":" "}]
[{"$nulls":9},{"$f":"IFERROR(VLOOKUP(D44,codigo_DEPARTAMENTO[],2,FALSE),\" \")","v":" "}]
[{"$nulls":9},{"$f":"IFERROR(VLOOKUP(D45,codigo_DEPARTAMENTO[],2,FALSE),\" \")","v":" "}]
[{"$nulls":9},{"$f":"IFERROR(VLOOKUP(D46,codigo_DEPARTAMENTO[],2,FALSE),\" \")","v":" "}]

{"sheet":"MAIZ","index":6,"n_rows":46,"n_cols":15,"rows_kept":46,"hidden":true,"merged":[[1,1,1,2],[1,3,1,4],[2,1,2,2],[2,3,2,4],[4,1,5,3],[9,1,10,6],[14,1,14,8],[15,1,15,2],[15,3,15,5],[15,7,16,7],[15,8,16,8],[16,1,16,2],[16,4,16,5],[17,1,17,2],[18,1,18,2],[19,1,19,2],[20,1,20,2],[21,1,21,2],[22,1,22,2],[23,1,23,2],[24,1,24,2],[25,1,25,2],[26,1,26,2],[27,1,27,2],[28,1,28,2],[29,1,29,2],[30,1,30,2],[31,1,31,2],[32,1,32,2],[33,1,33,2],[34,1,34,2],[35,1,35,2],[36,1,36,2],[37,1,37,2],[38,1,38,2],[39,1,39,2],[40,1,40,2],[41,1,41,2],[42,1,42,2],[43,1,43,2],[44,1,44,2],[45,1,45,2]]}
[{"$nulls":9},"Código Cultivo"]
[null,"CULTIVO:",null,"MAIZ",{"$nulls":5},{"$f":"IFERROR(VLOOKUP(D2,codigo_CULTIVOS[],2,FALSE),\" \")","v":10}]
[null,"SUPERFICIE ASEGURADA",null,{"$f":"SUM($G$19:$G$1000)","v":{"v":0,"d":"0.00"}}]
[]
[null,"COBERTURA DE INVERSIÓN"]
[]
[null,"Garantía (Kg/ha)","Inicio de Cobertura por Chacra (Kg/ha)","Valor del grano (U$S/ton)",{"$nulls":5},"Limite por Chcra (Kg/Ha)"]
[{"$nulls":3},{"$f":"Valores!F7","v":180},{"$nulls":5},{"$f":"B8-C8","v":0}]
[]
[null,"DAÑOS DIRECTOS",{"$nulls":7},"Daños Directos"]
[{"$nulls":9},{"$f":"IFERROR(VLOOKUP(C13,DDIRECTOS[#Data],2,FALSE),\"N\")","v":"N"}]
[null,"Aforo (U$S/ha)","Granizo/Inc","Resiembra","Viento","Falta de Piso ","Helada",null,null,"Código Granizo/Inc.","Código Viento","Resiembra S/N","Código Flata de Piso","Helada","Codigo_Resiembra"]
[{"$nulls":9},{"$f":"IFERROR(VLOOKUP(C13,codigo_DEDUCIBLE[#Data],2,FALSE),\"N\")","v":"N"},{"$f":"IFERROR(VLOOKUP(E13,codigo­_VIENTO[#All],2,FALSE),\"N\")","v":"N"},{"$f":"IF(D13=\"\",\"N\",\"S\")","v":"N"},{"$f":"IF(F13=\"SI\",\"S\",\"N\")","v":"N"},{"$f":"IF(G13=\"SI\",\"S\",\"N\")","v":"N"},{"$f":"IFERROR(VLOOKUP(D13,Codigo_Resiembra[#All],2,FALSE),\" \")","v":" "}]
[]
[null,"DATOS DEL CULTIVO MAIZ"]
[null,"Datos del bien",null,"Ubicación",null,null,"Cultivo","Acreedor"]
[{"$nulls":4},"Grados Decimales",null,"Superficie"]
[null,"Nombre de Chacra",null,"Depto.","Lat.","Long.","ha","Código del Acreedor","Observaciones","Cód Dpto"]
[{"$nulls":9},{"$f":"IFERROR(VLOOKUP(D19,codigo_DEPARTAMENTO[],2,FALSE),\" \")","v":" "}]
[{"$nulls":9},{"$f":"IFERROR(VLOOKUP(D20,codigo_DEPARTAMENTO[],2,FALSE),\" \")","v":" "}]
[{"$nulls":9},{"$f":"IFERROR(VLOOKUP(D21,codigo_DEPARTAMENTO[],2,FALSE),\" \")","v":" "}]
[{"$nulls":9},{"$f":"IFERROR(VLOOKUP(D22,codigo_DEPARTAMENTO[],2,FALSE),\" \")","v":" "}]
[{"$nulls":9},{"$f":"IFERROR(VLOOKUP(D23,codigo_DEPARTAMENTO[],2,FALSE),\" \")","v":" "}]
[{"$nulls":9},{"$f":"IFERROR(VLOOKUP(D24,codigo_DEPARTAMENTO[],2,FALSE),\" \")","v":" "}]
[{"$nulls":9},{"$f":"IFERROR(VLOOKUP(D25,codigo_DEPARTAMENTO[],2,FALSE),\" \")","v":" "}]
[{"$nulls":9},{"$f":"IFERROR(VLOOKUP(D26,codigo_DEPARTAMENTO[],2,FALSE),\" \")","v":" "}]
[{"$nulls":9},{"$f":"IFERROR(VLOOKUP(D27,codigo_DEPARTAMENTO[],2,FALSE),\" \")","v":" "}]
[{"$nulls":9},{"$f":"IFERROR(VLOOKUP(D28,codigo_DEPARTAMENTO[],2,FALSE),\" \")","v":" "}]
[{"$nulls":9},{"$f":"IFERROR(VLOOKUP(D29,codigo_DEPARTAMENTO[],2,FALSE),\" \")","v":" "}]
[{"$nulls":9},{"$f":"IFERROR(VLOOKUP(D30,codigo_DEPARTAMENTO[],2,FALSE),\" \")","v":" "}]
[{"$nulls":9},{"$f":"IFERROR(VLOOKUP(D31,codigo_DEPARTAMENTO[],2,FALSE),\" \")","v":" "}]
[{"$nulls":9},{"$f":"IFERROR(VLOOKUP(D32,codigo_DEPARTAMENTO[],2,FALSE),\" \")","v":" "}]
[{"$nulls":9},{"$f":"IFERROR(VLOOKUP(D33,codigo_DEPARTAMENTO[],2,FALSE),\" \")","v":" "}]
[{"$nulls":9},{"$f":"IFERROR(VLOOKUP(D34,codigo_DEPARTAMENTO[],2,FALSE),\" \")","v":" "}]
[{"$nulls":9},{"$f":"IFERROR(VLOOKUP(D35,codigo_DEPARTAMENTO[],2,FALSE),\" \")","v":" "}]
[{"$nulls":9},{"$f":"IFERROR(VLOOKUP(D36,codigo_DEPARTAMENTO[],2,FALSE),\" \")","v":" "}]
[{"$nulls":9},{"$f":"IFERROR(VLOOKUP(D37,codigo_DEPARTAMENTO[],2,FALSE),\" \")","v":" "}]
[{"$nulls":9},{"$f":"IFERROR(VLOOKUP(D38,codigo_DEPARTAMENTO[],2,FALSE),\" \")","v":" "}]
[{"$nulls":9},{"$f":"IFERROR(VLOOKUP(D39,codigo_DEPARTAMENTO[],2,FALSE),\" \")","v":" "}]
[{"$nulls":9},{"$f":"IFERROR(VLOOKUP(D40,codigo_DEPARTAMENTO[],2,FALSE),\" \")","v":" "}]
[{"$nulls":9},{"$f":"IFERROR(VLOOKUP(D41,codigo_DEPARTAMENTO[],2,FALSE),\" \")","v":" "}]
[{"$nulls":9},{"$f":"IFERROR(VLOOKUP(D42,codigo_DEPARTAMENTO[],2,FALSE),\" \")","v":" "}]
[{"$nulls":9},{"$f":"IFERROR(VLOOKUP(D43,codigo_DEPARTAMENTO[],2,FALSE),\" \")","v":" "}]
[{"$nulls":9},{"$f":"IFERROR(VLOOKUP(D44,codigo_DEPARTAMENTO[],2,FALSE),\" \")","v":" "}]
[{"$nulls":9},{"$f":"IFERROR(VLOOKUP(D45,codigo_DEPARTAMENTO[],2,FALSE),\" \")","v":" "}]
[{"$nulls":9},{"$f":"IFERROR(VLOOKUP(D46,codigo_DEPARTAMENTO[],2,FALSE),\" \")","v":" "}]

{"sheet":"Datos","index":7,"n_rows":11,"n_cols":27,"rows_kept":11,"hidden":true,"merged":[[0,0,0,1],[0,4,0,25],[7,4,7,26]]}
["CULTIVO",{"$nulls":3},"VIENTO"]
["INVIERNO","VERANO",null,null,"GIRASOL","SORGO","ARROZ","MOHA","SUDANGRASS","TRIGO","CEBADA","SOJA","MAIZ","AVENA","COLZA","CARINATA","LUPINO","VICIA","RAIGAS","FESTUCA","DACTYLIS","PHALARIS","ALFALFA","TRÉBOL","LOTUS","CAMELINA"]
["TRIGO","SOJA",null,null,"SI","SI","SI","SI","SI","SI","SI","SI","SI","SI","SI","SI","SI","SI","SI","SI","SI","SI","SI","SI","SI","SI"]
["CEBADA","MAIZ",{"$nulls":12},"CON HILERADO","CON HILERADO",{"$nulls":9},"CON HILERADO"]
["COLZA"]
["CARINATA"]
[]
[{"$nulls":4},"RESIEMBRA"]
[{"$nulls":4},"GIRASOL","SORGO","ARROZ","MOHA","SUDANGRASS","TRIGO","CEBADA","SOJA","MAIZ","AVENA","COLZA","CARINATA","LUPINO","VICIA","RAIGAS","FESTUCA","DACTYLIS","PHALARIS","ALFALFA","TREBOL ROJO","TREBOL BLANCO","LOTUS","CAMELINA"]
[{"$nulls":4},{"v":0.1,"d":"10%"},{"v":0.1,"d":"10%"},{"v":0.25,"d":"25%"},{"v":0.1,"d":"10%"},{"v":0.1,"d":"10%"},{"v":0.25,"d":"25%"},{"v":0.25,"d":"25%"},{"v":0.1,"d":"10%"},{"v":0.1,"d":"10%"},{"v":0.25,"d":"25%"},{"v":0.25,"d":"25%"},{"v":0.25,"d":"25%"},{"v":0.25,"d":"25%"},{"v":0.25,"d":"25%"},{"v":0.25,"d":"25%"},{"v":0.25,"d":"25%"},{"v":0.25,"d":"25%"},{"v":0.25,"d":"25%"},{"v":0.25,"d":"25%"},{"v":0.25,"d":"25%"},{"v":0.25,"d":"25%"},{"v":0.25,"d":"25%"},{"v":0.25,"d":"25%"}]
[{"$nulls":4},{"v":0.25,"d":"25%"},{"v":0.25,"d":"25%"},null,{"v":0.25,"d":"25%"},{"v":0.25,"d":"25%"},null,null,{"v":0.25,"d":"25%"},{"v":0.25,"d":"25%"}]

{"sheet":"Codigos","index":8,"n_rows":28,"n_cols":20,"rows_kept":28,"hidden":true}
["CULTIVO","Columna1",null,"Planes_de_Pagos","Còdigo",null,"DEPARTAMENTOS","Columna1",null,"GRANIZO/INC","Columna1",null,"VIENTO","Columna1",null,"DAÑOS DIRECTOS","Columna1",null,"RESIEMBRA","Columna1"]
["TRIGO",1,null,"CONTADO (FECHA DE EMISIÒN)",-1,null,"ARTIGAS",3,null,"FRANQUICIA 6%",1,null,"CON HILERADO","H",null,"FRANQUICIA 6%","S",null,{"v":0.1,"d":"10%"},10]
["CEBADA",2,null,"PREVIO PAGO",0,null,"CANELONES",2,null,"DEDUCIBLE 20%",8,null,"SI","S",null,"DEDUCIBLE 20%","S",null,{"v":0.25,"d":"25%"},25]
["AVENA",3,null,"CONTADO",1,null,"CERRO_LARGO",16]
["COLZA",15,null,"2 PAGOS",2,null,"COLONIA",8]
["CARINATA",9,null,"3 PAGOS",3,null,"DURAZNO",14]
["LUPINO",123,null,"4 PAGOS",4,null,"FLORES",10]
["VICIA",124,null,"5 PAGOS",5,null,"FLORIDA",11]
["RAIGRAS",20,null,"6 PAGOS",6,null,"LAVALLEJA",17]
["FESTUCA",85,null,"7 PAGOS",7,null,"MONTEVIDEO",1]
["DACTYLIS",18,null,"8 PAGOS",8,null,"MALDONADO",19]
["PHALARIS",19,null,"9 PAGOS",9,null,"PAYSANDU",5]
["ALFALFA",64,null,"10 PAGOS",10,null,"RIO_NEGRO",6]
["TREBOL ROJO",21,null,"1 PAGO DIFERIDO A FIN DE VIGENCIA",115,null,"RIVERA",12]
["LOTUS",17,{"$nulls":4},"ROCHA",18]
["SOJA",12,{"$nulls":4},"SALTO",4]
["GIRASOL",8,{"$nulls":4},"SAN_JOSE",9]
["MAIZ",10,{"$nulls":4},"SORIANO",7]
["SORGO",13,{"$nulls":4},"TACUAREMBO",13]
["ARROZ",7,{"$nulls":4},"TREINTA_Y_TRES",15]
["MOHA",62,{"$nulls":4},"Cerro Largo",16]
["SUDANGRASS",63,{"$nulls":4},"Río Negro",6]
["CAMELINA",125,{"$nulls":4},"Tacuarembó",13]
["TREBOL BLANCO",21,{"$nulls":4},"Treinta y Tres",15]
[{"$nulls":6},"San José",9]
[{"$nulls":6},"Rio Negro",6]
[{"$nulls":6},"San Jose",9]
[{"$nulls":6},"Paysandú",5]

{"sheet":"Valores","index":9,"n_rows":25,"n_cols":12,"rows_kept":25,"hidden":true,"merged":[[0,1,0,2],[0,3,0,4],[0,9,0,10]]}
[null,"INICIO DE COBERTURA",null,"GARANTIA",null,"VALOR GRANO",{"$nulls":3},"AFORO"]
["TRIGO",1200,3500,2200,4500,220,{"$nulls":3},"MINIMO","MAXIMO"]
["CEBADA",1200,3500,2200,4500,220,null,"TRIGO",{"$f":"J3*0.1","v":40},400,800,{"$f":"K3*1.5","v":1200}]
["COLZA",300,1100,800,1600,450,null,"CEBADA",{"$f":"J4*0.1","v":40},400,800,{"$f":"K4*1.5","v":1200}]
["CARINATA",300,1100,800,1600,450,null,"AVENA",40,400,800,1200]
["SOJA",200,1500,1000,2200,390,null,"COLZA",40,400,850,1275]
["MAIZ",800,3000,3000,6000,180,null,"CARINATA",40,400,850,1275]
[0,{"$nulls":6},"LUPINO",40,400,700,1050]
[0,{"$nulls":6},"VICIA",40,400,700,1050]
[0,{"$nulls":6},"RAIGRAS",40,400,700,1050]
[0,{"$nulls":6},"FESTUCA",40,400,700,1050]
[0,{"$nulls":6},"DACTYLIS",40,400,700,1050]
[0,{"$nulls":6},"PHALARIS",40,400,700,1050]
[{"$nulls":7},"ALFALFA",40,400,700,1050]
[{"$nulls":7},"TREBOL ROJO",40,400,700,1050]
[{"$nulls":7},"TREBOL BLANCO",{"$f":"J16*0.1","v":40},400,700,{"$f":"K16*1.5","v":1050}]
[{"$nulls":7},"LOTUS",40,400,700,1050]
[{"$nulls":7},"CAMELINA",{"$f":"J18*0.1","v":40},400,700,{"$f":"K18*1.5","v":1050}]
[{"$nulls":7},"SOJA",45,450,900,1350]
[{"$nulls":7},"GIRASOL",40,400,800,1200]
[{"$nulls":7},"MAIZ",55,550,1100,1650]
[{"$nulls":7},"SORGO",40,400,800,1200]
[{"$nulls":7},"ARROZ",100,1000,2000,3000]
[{"$nulls":7},"MOHA",40,400,800,1200]
[{"$nulls":7},"SUDANGRASS",40,400,800,1200]